BDBM50055205 CHEMBL136669::Trimethyl-(2-methyl-5-propionyloxy-phenyl)-ammonium
SMILES CCC(=O)Oc1ccc(C)c(c1)[N+](C)(C)C
InChI Key InChIKey=CZVATJJPBCSTOP-UHFFFAOYSA-N
Data  2 IC50
  Tab Delimited (TSV)   2D SDfile   Computed 3D by Vconf -m prep SDfile
Find this compound or compounds like it in BindingDB:
Activity Spreadsheet -- Enzyme Inhibition Constant Data from BindingDB
Found 2 hits for monomerid = 50055205
TargetAcetylcholinesterase(Homo sapiens (Human))
Harvard University
Curated by ChEMBL
LigandPNGBDBM50055205(CHEMBL136669 | Trimethyl-(2-methyl-5-propionyloxy-...)
Affinity DataIC50:  6.90E+4nM. Assay description: Inhibition acetylcholinesterase (AChE) enzyme.
In DepthDetails ArticlePubMed
TargetAcetylcholinesterase(Electrophorus electricus (Electric eel))
University Of North Carolina
Curated by ChEMBL
LigandPNGBDBM50055205(CHEMBL136669 | Trimethyl-(2-methyl-5-propionyloxy-...)
Affinity DataIC50:  6.91E+4nM. Assay description: Inhibitory activity against Acetylcholinesterase
In DepthDetails ArticlePubMed