BDBM50056888 2-Hydroxy-benzoic acid N'-(2-mercapto-benzoyl)-hydrazide::CHEMBL425852
SMILES Oc1ccccc1C(=O)NNC(=O)c1ccccc1S
InChI Key InChIKey=GMKXQIDJHZSYRQ-UHFFFAOYSA-N
Data  2 IC50
  Tab Delimited (TSV)   2D SDfile   Computed 3D by Vconf -m prep SDfile
Find this compound or compounds like it in BindingDB:
Activity Spreadsheet -- Enzyme Inhibition Constant Data from BindingDB
Found 2 hits for monomerid = 50056888
TargetIntegrase(Human immunodeficiency virus 1)
National Cancer Institute-Bethesda
Curated by ChEMBL
LigandPNGBDBM50056888(2-Hydroxy-benzoic acid N'-(2-mercapto-benzoyl)-hyd...)
Affinity DataIC50:  5.80E+3nM. Assay description: Inhibition of HIV-1 integrase enzyme
In DepthDetails ArticlePubMed
TargetIntegrase(Human immunodeficiency virus 1)
National Cancer Institute-Bethesda
Curated by ChEMBL
LigandPNGBDBM50056888(2-Hydroxy-benzoic acid N'-(2-mercapto-benzoyl)-hyd...)
Affinity DataIC50:  9.10E+3nM. Assay description: Inhibition of HIV-1 integrase enzyme by 3'-processing method
In DepthDetails ArticlePubMed