BDBM50057217 5-Bromo-2-hydroxy-3-{(E)-3-[3-((E)-2-quinolin-2-yl-vinyl)-phenyl]-acryloyl}-benzoic acid::5-bromo-2-hydroxy-3-(3-(3-(2-(quinolin-2-yl)vinyl)phenyl)acryloyl)benzoic acid::CHEMBL11349
SMILES OC(=O)c1cc(Br)cc(C(=O)\C=C\c2cccc(\C=C\c3ccc4ccccc4n3)c2)c1O
InChI Key InChIKey=FIJKMECDVUAIRF-BLTLMDCKSA-N
Data  1 IC50  1 Kd
  Tab Delimited (TSV)   2D SDfile   Computed 3D by Vconf -m prep SDfile
Find this compound or compounds like it in BindingDB:
Activity Spreadsheet -- Enzyme Inhibition Constant Data from BindingDB
Found 2 hits for monomerid = 50057217
TargetCysteinyl leukotriene receptor 1/2(Homo sapiens (Human))
Vrije Universiteit
Curated by ChEMBL
LigandPNGBDBM50057217(5-Bromo-2-hydroxy-3-{(E)-3-[3-((E)-2-quinolin-2-yl...)
Affinity DataKd:  207nM. Assay description: Displacement of [3H]LTD4 from Cysteinyl leukotriene D4 receptor in guinea pig lung membranes
In DepthDetails ArticlePubMed
TargetCysteinyl leukotriene receptor 1(Homo sapiens (Human))
Zhejiang University
Curated by ChEMBL
LigandPNGBDBM50057217(5-Bromo-2-hydroxy-3-{(E)-3-[3-((E)-2-quinolin-2-yl...)
Affinity DataIC50:  207nM. Assay description: Antagonist activity at CysLT1 receptor in human dU937 cells assessed as inhibition of LTD4-induced increase of calcium level treated 30 mins before L...
In DepthDetails ArticlePubMed