BDBM50057767 CHEMBL3323017::US9598387, Compound 116::US9969743, 116
SMILES CC(C)(C)c1nc(cc(n1)C(F)(F)F)N1CCN(CCCCNC(=O)c2cn3nc(Cl)ccc3n2)CC1
InChI Key InChIKey=VCZAICHKRVTUHW-UHFFFAOYSA-N
Data  6 KI  4 IC50
  Tab Delimited (TSV)   2D SDfile   Computed 3D by Vconf -m prep SDfile
Find this compound or compounds like it in BindingDB:
Activity Spreadsheet -- Enzyme Inhibition Constant Data from BindingDB
Found 10 hits for monomerid = 50057767
TargetD(3) dopamine receptor(Homo sapiens (Human))
Southern Research Institute
Curated by ChEMBL
LigandPNGBDBM50057767(CHEMBL3323017 | US9598387, Compound 116 | US996974...)
Affinity DataKi:  10nM. Assay description: Displacement of [125I]IABN from human D3R expressed in HEK293 cell membranes by gamma counting method
In DepthDetails ArticlePubMed
TargetD(3) dopamine receptor(Homo sapiens (Human))
Southern Research Institute
Curated by ChEMBL
LigandPNGBDBM50057767(CHEMBL3323017 | US9598387, Compound 116 | US996974...)
Affinity DataKi:  10.2nM. Assay description: Stably transfected HEK cells expressing the human D2-long and the D3 dopamine receptor were developed using the pIRESneo2 bicistronic expression vect...
In DepthDetails US Patent
TargetD(3) dopamine receptor(Homo sapiens (Human))
Southern Research Institute
Curated by ChEMBL
LigandPNGBDBM50057767(CHEMBL3323017 | US9598387, Compound 116 | US996974...)
Affinity DataKi:  10.2nM. Assay description: The affinities of the target compounds were determined using radioligand binding experiments. All radioligand binding experiments were performed acco...
In DepthDetails US Patent
TargetD(2) dopamine receptor(Homo sapiens (Human))
Southern Research Institute
US Patent
LigandPNGBDBM50057767(CHEMBL3323017 | US9598387, Compound 116 | US996974...)
Affinity DataKi:  655nM. Assay description: The affinities of the target compounds were determined using radioligand binding experiments. All radioligand binding experiments were performed acco...
In DepthDetails US Patent
TargetD(2) dopamine receptor(Homo sapiens (Human))
Southern Research Institute
US Patent
LigandPNGBDBM50057767(CHEMBL3323017 | US9598387, Compound 116 | US996974...)
Affinity DataKi:  655nM. Assay description: Stably transfected HEK cells expressing the human D2-long and the D3 dopamine receptor were developed using the pIRESneo2 bicistronic expression vect...
In DepthDetails US Patent
TargetD(2) dopamine receptor(Homo sapiens (Human))
Southern Research Institute
US Patent
LigandPNGBDBM50057767(CHEMBL3323017 | US9598387, Compound 116 | US996974...)
Affinity DataKi:  655nM. Assay description: Displacement of [125I]IABN from human D2LR expressed in HEK293 cell membranes by gamma counting method
In DepthDetails ArticlePubMed
TargetD(2) dopamine receptor(Homo sapiens (Human))
Southern Research Institute
US Patent
LigandPNGBDBM50057767(CHEMBL3323017 | US9598387, Compound 116 | US996974...)
Affinity DataIC50:  1.16E+3nM. Assay description: Antagonist activity against human D2R expressed in CHO cells assessed as inhibition of quinpirole-induced mitogenesis after 24 hrs by [3H]thymidine u...
In DepthDetails ArticlePubMed
TargetD(2) dopamine receptor(Homo sapiens (Human))
Southern Research Institute
US Patent
LigandPNGBDBM50057767(CHEMBL3323017 | US9598387, Compound 116 | US996974...)
Affinity DataIC50:  22nM. Assay description: Antagonist activity against human D2LR expressed in CHOK1 cells assessed as inhibition of pergolide-induced beta-arrestin translocation by beta-galac...
In DepthDetails ArticlePubMed
TargetD(3) dopamine receptor(Homo sapiens (Human))
Southern Research Institute
Curated by ChEMBL
LigandPNGBDBM50057767(CHEMBL3323017 | US9598387, Compound 116 | US996974...)
Affinity DataIC50:  0.300nM. Assay description: Antagonist activity against D3R in human U2OS cells assessed as inhibition of (+)-PD128907-induced beta-arrestin translocation by beta-galactosidase ...
In DepthDetails ArticlePubMed
TargetD(3) dopamine receptor(Homo sapiens (Human))
Southern Research Institute
Curated by ChEMBL
LigandPNGBDBM50057767(CHEMBL3323017 | US9598387, Compound 116 | US996974...)
Affinity DataIC50:  637nM. Assay description: Antagonist activity against human D3R expressed in CHO cells assessed as inhibition of quinpirole-induced mitogenesis after 24 hrs by [3H]thymidine u...
In DepthDetails ArticlePubMed