BDBM50057769 CHEMBL3323014
SMILES CC(C)(C)c1nc(cc(n1)C(F)(F)F)N1CCN(CCCCNC(=O)c2cc3cccnc3s2)CC1
InChI Key InChIKey=NOWHSPBMDLMCKJ-UHFFFAOYSA-N
Data  2 KI
  Tab Delimited (TSV)   2D SDfile   Computed 3D by Vconf -m prep SDfile
Find this compound or compounds like it in BindingDB:
Activity Spreadsheet -- Enzyme Inhibition Constant Data from BindingDB
Found 2 hits for monomerid = 50057769
TargetD(3) dopamine receptor(Homo sapiens (Human))
Southern Research Institute
Curated by ChEMBL
LigandPNGBDBM50057769(CHEMBL3323014)
Affinity DataKi:  32nM. Assay description: Displacement of [125I]IABN from human D3R expressed in HEK293 cell membranes by gamma counting method
In DepthDetails ArticlePubMed
TargetD(2) dopamine receptor(Homo sapiens (Human))
Southern Research Institute
Curated by ChEMBL
LigandPNGBDBM50057769(CHEMBL3323014)
Affinity DataKi:  683nM. Assay description: Displacement of [125I]IABN from human D2LR expressed in HEK293 cell membranes by gamma counting method
In DepthDetails ArticlePubMed