BDBM50057773 CHEMBL3322995
SMILES FC(F)(F)c1cccc(c1)N1CCN(CCCCNC(=O)c2cn3ccccc3n2)CC1
InChI Key InChIKey=UDOZPIGWNKAYKX-UHFFFAOYSA-N
Data  2 KI  2 IC50
  Tab Delimited (TSV)   2D SDfile   Computed 3D by Vconf -m prep SDfile
Find this compound or compounds like it in BindingDB:
Activity Spreadsheet -- Enzyme Inhibition Constant Data from BindingDB
Found 4 hits for monomerid = 50057773
TargetD(3) dopamine receptor(Homo sapiens (Human))
Southern Research Institute
Curated by ChEMBL
LigandPNGBDBM50057773(CHEMBL3322995)
Affinity DataKi:  2.90nM. Assay description: Displacement of [125I]IABN from human D3R expressed in HEK293 cell membranes by gamma counting method
In DepthDetails ArticlePubMed
TargetD(2) dopamine receptor(Homo sapiens (Human))
Southern Research Institute
Curated by ChEMBL
LigandPNGBDBM50057773(CHEMBL3322995)
Affinity DataKi:  162nM. Assay description: Displacement of [125I]IABN from human D2LR expressed in HEK293 cell membranes by gamma counting method
In DepthDetails ArticlePubMed
TargetD(3) dopamine receptor(Homo sapiens (Human))
Southern Research Institute
Curated by ChEMBL
LigandPNGBDBM50057773(CHEMBL3322995)
Affinity DataIC50:  1.80nM. Assay description: Antagonist activity against D3R in human U2OS cells assessed as inhibition of (+)-PD128907-induced beta-arrestin translocation by beta-galactosidase ...
In DepthDetails ArticlePubMed
TargetD(2) dopamine receptor(Homo sapiens (Human))
Southern Research Institute
Curated by ChEMBL
LigandPNGBDBM50057773(CHEMBL3322995)
Affinity DataIC50:  60nM. Assay description: Antagonist activity against human D2LR expressed in CHOK1 cells assessed as inhibition of pergolide-induced beta-arrestin translocation by beta-galac...
In DepthDetails ArticlePubMed