BDBM50057779 CHEMBL3323008::US9598387, Compound 111::US9969743, 111
SMILES Cc1cc(nc(n1)C(C)(C)C)N1CCN(CCCCNC(=O)c2cn3ccccc3n2)CC1
InChI Key InChIKey=HWNDEDIZZJRHGF-UHFFFAOYSA-N
Data  6 KI
  Tab Delimited (TSV)   2D SDfile   Computed 3D by Vconf -m prep SDfile
Find this compound or compounds like it in BindingDB:
Activity Spreadsheet -- Enzyme Inhibition Constant Data from BindingDB
Found 6 hits for monomerid = 50057779
TargetD(3) dopamine receptor(Homo sapiens (Human))
Southern Research Institute
Curated by ChEMBL
LigandPNGBDBM50057779(CHEMBL3323008 | US9598387, Compound 111 | US996974...)
Affinity DataKi:  9.30nM. Assay description: Displacement of [125I]IABN from human D3R expressed in HEK293 cell membranes by gamma counting method
In DepthDetails ArticlePubMed
TargetD(3) dopamine receptor(Homo sapiens (Human))
Southern Research Institute
Curated by ChEMBL
LigandPNGBDBM50057779(CHEMBL3323008 | US9598387, Compound 111 | US996974...)
Affinity DataKi:  9.30nM. Assay description: The affinities of the target compounds were determined using radioligand binding experiments. All radioligand binding experiments were performed acco...
In DepthDetails US Patent
TargetD(3) dopamine receptor(Homo sapiens (Human))
Southern Research Institute
Curated by ChEMBL
LigandPNGBDBM50057779(CHEMBL3323008 | US9598387, Compound 111 | US996974...)
Affinity DataKi:  9.30nM. Assay description: Stably transfected HEK cells expressing the human D2-long and the D3 dopamine receptor were developed using the pIRESneo2 bicistronic expression vect...
In DepthDetails US Patent
TargetD(2) dopamine receptor(Homo sapiens (Human))
Southern Research Institute
US Patent
LigandPNGBDBM50057779(CHEMBL3323008 | US9598387, Compound 111 | US996974...)
Affinity DataKi:  366nM. Assay description: The affinities of the target compounds were determined using radioligand binding experiments. All radioligand binding experiments were performed acco...
In DepthDetails US Patent
TargetD(2) dopamine receptor(Homo sapiens (Human))
Southern Research Institute
US Patent
LigandPNGBDBM50057779(CHEMBL3323008 | US9598387, Compound 111 | US996974...)
Affinity DataKi:  366nM. Assay description: Stably transfected HEK cells expressing the human D2-long and the D3 dopamine receptor were developed using the pIRESneo2 bicistronic expression vect...
In DepthDetails US Patent
TargetD(2) dopamine receptor(Homo sapiens (Human))
Southern Research Institute
US Patent
LigandPNGBDBM50057779(CHEMBL3323008 | US9598387, Compound 111 | US996974...)
Affinity DataKi:  366nM. Assay description: Displacement of [125I]IABN from human D2LR expressed in HEK293 cell membranes by gamma counting method
In DepthDetails ArticlePubMed