BDBM50057895 1-(4-Fluoro-phenyl)-5-(4-methanesulfonyl-phenyl)-2-methyl-1H-pyrrole-3-carbonitrile::CHEMBL43366
SMILES Cc1c(cc(-c2ccc(cc2)S(C)(=O)=O)n1-c1ccc(F)cc1)C#N
InChI Key InChIKey=QEGGTROSBAMMCJ-UHFFFAOYSA-N
Data  6 IC50
  Tab Delimited (TSV)   2D SDfile   Computed 3D by Vconf -m prep SDfile
Find this compound or compounds like it in BindingDB:
Activity Spreadsheet -- Enzyme Inhibition Constant Data from BindingDB
Found 6 hits for monomerid = 50057895
TargetProstaglandin G/H synthase 1(Homo sapiens (Human))
Searle Research And Development
Curated by ChEMBL
LigandPNGBDBM50057895(1-(4-Fluoro-phenyl)-5-(4-methanesulfonyl-phenyl)-2...)
Affinity DataIC50: >1.00E+5nM. Assay description: In vitro inhibitory activity against human prostaglandin G/H synthase 1
In DepthDetails ArticlePubMed
TargetProstaglandin G/H synthase 2(Homo sapiens (Human))
Searle Research And Development
Curated by ChEMBL
LigandPNGBDBM50057895(1-(4-Fluoro-phenyl)-5-(4-methanesulfonyl-phenyl)-2...)
Affinity DataIC50:  750nM. Assay description: In vitro inhibitory activity against human prostaglandin G/H synthase 2
In DepthDetails ArticlePubMed
TargetProstaglandin G/H synthase 2(Homo sapiens (Human))
Searle Research And Development
Curated by ChEMBL
LigandPNGBDBM50057895(1-(4-Fluoro-phenyl)-5-(4-methanesulfonyl-phenyl)-2...)
Affinity DataIC50:  750nM. Assay description: Inhibition of human COX2
In DepthDetails ArticlePubMed
TargetProstaglandin G/H synthase 2(Mus musculus (Mouse))
Universit£
Curated by ChEMBL
LigandPNGBDBM50057895(1-(4-Fluoro-phenyl)-5-(4-methanesulfonyl-phenyl)-2...)
Affinity DataIC50:  29nM. Assay description: Inhibition of COX2 in mouse J774 cells assessed as inhibition of LPS-induced PGE2 production by radioimmunoassay
In DepthDetails ArticlePubMed
TargetProstaglandin G/H synthase 1(Mus musculus)
Universit£
Curated by ChEMBL
LigandPNGBDBM50057895(1-(4-Fluoro-phenyl)-5-(4-methanesulfonyl-phenyl)-2...)
Affinity DataIC50: >1.00E+4nM. Assay description: Inhibition of COX1 in mouse J774 cells using arachidonic acid as substrate assessed as inhibition of PGE2 production incubated for 15 mins prior to s...
In DepthDetails ArticlePubMed
TargetProstaglandin G/H synthase 2(Homo sapiens (Human))
Searle Research And Development
Curated by ChEMBL
LigandPNGBDBM50057895(1-(4-Fluoro-phenyl)-5-(4-methanesulfonyl-phenyl)-2...)
Affinity DataIC50:  759nM. Assay description: Inhibition of human Prostaglandin G/H synthase 2
In DepthDetails ArticlePubMed