BDBM50058307 CHEMBL3331389
SMILES O=c1sc2ccccc2n1CCCCCCCN1CCN(CC1)c1ccccc1
InChI Key InChIKey=BTWVUAHQSYTQBK-UHFFFAOYSA-N
Data  2 KI
  Tab Delimited (TSV)   2D SDfile   Computed 3D by Vconf -m prep SDfile
Find this compound or compounds like it in BindingDB:
Activity Spreadsheet -- Enzyme Inhibition Constant Data from BindingDB
Found 2 hits for monomerid = 50058307
Target5-hydroxytryptamine receptor 1A(Homo sapiens (Human))
Universit£
Curated by ChEMBL
LigandPNGBDBM50058307(CHEMBL3331389)
Affinity DataKi:  0.270nM. Assay description: Displacement of [3H]8-OH-DPAT from human 5-HT1A receptor transfected in CFO-K1 cells after 30 mins by liquid scintillation spectrometry
In DepthDetails ArticlePubMed
Target5-hydroxytryptamine receptor 7(Homo sapiens (Human))
Universit£
Curated by ChEMBL
LigandPNGBDBM50058307(CHEMBL3331389)
Affinity DataKi:  7.60nM. Assay description: Displacement of [3H]5-HT from human 5HT7 receptor transfected in CFO-K1 cells after 30 mins by liquid scintillation spectrometry
In DepthDetails ArticlePubMed