BDBM50058328 CHEMBL3331256
SMILES COc1ccccc1N1CCN(CCCCn2c3ccccc3oc2=O)CC1
InChI Key InChIKey=LYFIWEIPIISOAR-UHFFFAOYSA-N
Data  2 KI
  Tab Delimited (TSV)   2D SDfile   Computed 3D by Vconf -m prep SDfile
Find this compound or compounds like it in BindingDB:
Activity Spreadsheet -- Enzyme Inhibition Constant Data from BindingDB
Found 2 hits for monomerid = 50058328
Target5-hydroxytryptamine receptor 7(Homo sapiens (Human))
Universit£
Curated by ChEMBL
LigandPNGBDBM50058328(CHEMBL3331256)
Affinity DataKi:  10nM. Assay description: Displacement of [3H]5-HT from human 5HT7 receptor transfected in CFO-K1 cells after 30 mins by liquid scintillation spectrometry
In DepthDetails ArticlePubMed
Target5-hydroxytryptamine receptor 1A(Homo sapiens (Human))
Universit£
Curated by ChEMBL
LigandPNGBDBM50058328(CHEMBL3331256)
Affinity DataKi:  19nM. Assay description: Displacement of [3H]8-OH-DPAT from human 5-HT1A receptor transfected in CFO-K1 cells after 30 mins by liquid scintillation spectrometry
In DepthDetails ArticlePubMed