BDBM50061332 (3-Phenoxy-propyl)-(2-p-tolyloxy-ethyl)-amine::CHEMBL128647
SMILES Cc1ccc(OCCNCCCOc2ccccc2)cc1
InChI Key InChIKey=MJWITHOHGGKZJZ-UHFFFAOYSA-N
Data  6 KI
  Tab Delimited (TSV)   2D SDfile   Computed 3D by Vconf -m prep SDfile
Find this compound or compounds like it in BindingDB:
Activity Spreadsheet -- Enzyme Inhibition Constant Data from BindingDB
Found 6 hits for monomerid = 50061332
TargetD(4) dopamine receptor(Homo sapiens (Human))
Warner-Lambert
Curated by ChEMBL
LigandPNGBDBM50061332((3-Phenoxy-propyl)-(2-p-tolyloxy-ethyl)-amine | CH...)
Affinity DataKi:  0.520nM. Assay description: Binding affinity to recombinant human dopamine receptor D4 expressed in CHO cells by displacement of [3H]-spiperone
In DepthDetails ArticlePubMed
TargetD(4) dopamine receptor(Homo sapiens (Human))
Warner-Lambert
Curated by ChEMBL
LigandPNGBDBM50061332((3-Phenoxy-propyl)-(2-p-tolyloxy-ethyl)-amine | CH...)
Affinity DataKi:  0.525nM. Assay description: Binding affinity to displace [3H]spiperone from cloned human dopamine receptor D4 was determined
In DepthDetails ArticlePubMed
TargetD(3) dopamine receptor(Homo sapiens (Human))
Warner-Lambert
Curated by ChEMBL
LigandPNGBDBM50061332((3-Phenoxy-propyl)-(2-p-tolyloxy-ethyl)-amine | CH...)
Affinity DataKi:  169nM. Assay description: Binding affinity against cloned human dopamine receptor D3 expressed in Chinese hamster ovary (CHO) K-1 cells by displacement of [3H]-spiperone.
In DepthDetails ArticlePubMed
TargetD(3) dopamine receptor(Homo sapiens (Human))
Warner-Lambert
Curated by ChEMBL
LigandPNGBDBM50061332((3-Phenoxy-propyl)-(2-p-tolyloxy-ethyl)-amine | CH...)
Affinity DataKi:  170nM. Assay description: Binding affinity to displace [3H]spiperone from cloned human dopamine receptor D3 was determined
In DepthDetails ArticlePubMed
TargetD(2) dopamine receptor(Homo sapiens (Human))
Warner-Lambert
Curated by ChEMBL
LigandPNGBDBM50061332((3-Phenoxy-propyl)-(2-p-tolyloxy-ethyl)-amine | CH...)
Affinity DataKi:  268nM. Assay description: Binding affinity against cloned human dopamine receptor D2 expressed in Chinese hamster ovary (CHO) K-1 cells by displacement of [3H]-spiperone.
In DepthDetails ArticlePubMed
TargetD(2) dopamine receptor(Homo sapiens (Human))
Warner-Lambert
Curated by ChEMBL
LigandPNGBDBM50061332((3-Phenoxy-propyl)-(2-p-tolyloxy-ethyl)-amine | CH...)
Affinity DataKi:  269nM. Assay description: Binding affinity to displace [3H]spiperone from cloned human dopamine receptor D2 was determined
In DepthDetails ArticlePubMed