BDBM50061513 (S)-2-((S)-2-Acetylamino-3-methyl-butyrylamino)-3-methyl-N-[(S)-2-methyl-1-(3,3,3-trifluoro-1-methyl-2-oxo-propylcarbamoyl)-propyl]-butyramide::CHEMBL131097
SMILES CC(C)[C@H](NC(C)=O)C(=O)N[C@@H](C(C)C)C(=O)N[C@@H](C(C)C)C(=O)NC(C)C(=O)C(F)(F)F
InChI Key InChIKey=ZMUXQSPYJHQGDH-QJIWQAPWSA-N
Data  1 IC50
  Tab Delimited (TSV)   2D SDfile   Computed 3D by Vconf -m prep SDfile
Find this compound or compounds like it in BindingDB:
Activity Spreadsheet -- Enzyme Inhibition Constant Data from BindingDB
Found 1 hit for monomerid = 50061513
TargetGenome polyprotein(Human rhinovirus B)
Boehringer Ingelheim
Curated by ChEMBL
LigandPNGBDBM50061513((S)-2-((S)-2-Acetylamino-3-methyl-butyrylamino)-3-...)
Affinity DataIC50:  6.10E+4nM. Assay description: Micro molar potency of the compound to inhibit human cytomegalovirus (HCMV) protease
In DepthDetails ArticlePubMed