BDBM50062110 1-Isopropyl-3-[4-(2-methyl-imidazo[4,5-c]pyridin-1-ylmethyl)-benzoyl]-1H-indole-4-carboxylic acid methyl ester::CHEMBL172819
SMILES COC(=O)c1cccc2n(cc(C(=O)c3ccc(Cn4c(C)nc5cnccc45)cc3)c12)C(C)C
InChI Key InChIKey=GNPNYMFYLRABBZ-UHFFFAOYSA-N
Data  1 KI
  Tab Delimited (TSV)   2D SDfile   Computed 3D by Vconf -m prep SDfile
Find this compound or compounds like it in BindingDB:
Activity Spreadsheet -- Enzyme Inhibition Constant Data from BindingDB
Found 1 hit for monomerid = 50062110
TargetPlatelet-activating factor receptor(Cavia porcellus)
Abbott Laboratories
Curated by ChEMBL
LigandPNGBDBM50062110(1-Isopropyl-3-[4-(2-methyl-imidazo[4,5-c]pyridin-1...)
Affinity DataKi:  1.30nM. Assay description: Binding potency against Platelet activating factor (PAF) receptor using [3H]-C18-PAF as radioligand on rabbit platelet membranes
In DepthDetails ArticlePubMed