BDBM50062509 CHEMBL3397548
SMILES O\N=C\c1ccc(OC(Cc2ccccc2)C(O)=O)cc1
InChI Key InChIKey=NIDDHYAQKFHAMY-GZTJUZNOSA-N
Data  2 EC50
  Tab Delimited (TSV)   2D SDfile   Computed 3D by Vconf -m prep SDfile
Find this compound or compounds like it in BindingDB:
Activity Spreadsheet -- Enzyme Inhibition Constant Data from BindingDB
Found 2 hits for monomerid = 50062509
TargetPeroxisome proliferator-activated receptor gamma(Homo sapiens (Human))
Universit£
Curated by ChEMBL
LigandPNGBDBM50062509(CHEMBL3397548)
Affinity DataEC50:  4.30E+4nM. Assay description: Agonist activity at GAL4-DNA binding domain fused human PPARgamma ligand binding domain expressed in human HepG2 cells assessed as receptor transacti...
In DepthDetails ArticlePubMed
TargetPeroxisome proliferator-activated receptor alpha(Homo sapiens (Human))
Universit£
Curated by ChEMBL
LigandPNGBDBM50062509(CHEMBL3397548)
Affinity DataEC50:  7.75E+3nM. Assay description: Agonist activity at GAL4-DNA binding domain fused human PPARalpha ligand binding domain expressed in human HepG2 cells assessed as receptor transacti...
In DepthDetails ArticlePubMed