BDBM50062517 CHEMBL3397557
SMILES OC(=O)C(Cc1ccccc1)Oc1ccc(\C=N\OCc2ccccc2)cc1
InChI Key InChIKey=FHVKUUAXZYQIOZ-LFVJCYFKSA-N
Data  2 EC50
  Tab Delimited (TSV)   2D SDfile   Computed 3D by Vconf -m prep SDfile
Find this compound or compounds like it in BindingDB:
Activity Spreadsheet -- Enzyme Inhibition Constant Data from BindingDB
Found 2 hits for monomerid = 50062517
TargetPeroxisome proliferator-activated receptor alpha(Homo sapiens (Human))
Universit£
Curated by ChEMBL
LigandPNGBDBM50062517(CHEMBL3397557)
Affinity DataEC50:  6.80E+3nM. Assay description: Agonist activity at GAL4-DNA binding domain fused human PPARgamma ligand binding domain expressed in human HepG2 cells assessed as receptor transacti...
In DepthDetails ArticlePubMed
TargetPeroxisome proliferator-activated receptor gamma(Homo sapiens (Human))
Universit£
Curated by ChEMBL
LigandPNGBDBM50062517(CHEMBL3397557)
Affinity DataEC50:  2.10E+3nM. Assay description: Agonist activity at GAL4-DNA binding domain fused human PPARalpha ligand binding domain expressed in human HepG2 cells assessed as receptor transacti...
In DepthDetails ArticlePubMed