BDBM50062731 CHEMBL3397717
SMILES CCCC\C(=C/c1cc(OCc2cc(cc(c2)C(F)(F)F)C(F)(F)F)ccc1OCc1ccc(cc1)C(F)(F)F)C(O)=O
InChI Key InChIKey=JJTWGKMJWUIUPQ-DEDYPNTBSA-N
Data  5 IC50  2 EC50
  Tab Delimited (TSV)   2D SDfile   Computed 3D by Vconf -m prep SDfile
Find this compound or compounds like it in BindingDB:
Activity Spreadsheet -- Enzyme Inhibition Constant Data from BindingDB
Found 7 hits for monomerid = 50062731
TargetPolyunsaturated fatty acid 5-lipoxygenase(Homo sapiens (Human))
Goethe-University Frankfurt
Curated by ChEMBL
LigandPNGBDBM50062731(CHEMBL3397717)
Affinity DataIC50:  300nM. Assay description: Inhibition of 5-LO in human human PMNL assessed as reduction in 5-LO product formation pre-incubated for 15 mins before addition of arachidonic acid ...
In DepthDetails ArticlePubMed
TargetPresenilin-1(Homo sapiens (Human))
Goethe-University Frankfurt
Curated by ChEMBL
LigandPNGBDBM50062731(CHEMBL3397717)
Affinity DataEC50:  1.00E+3nM. Assay description: Activation of wild-type human presenilin-1 stably overexpressed in CHO cells co-expressing wild-type human amyloid precursor protein assessed as amyl...
In DepthDetails ArticlePubMed
TargetPresenilin-1(Homo sapiens (Human))
Goethe-University Frankfurt
Curated by ChEMBL
LigandPNGBDBM50062731(CHEMBL3397717)
Affinity DataIC50:  790nM. Assay description: Inhibition of wild-type human presenilin-1 stably overexpressed in CHO cells co-expressing wild-type human amyloid precursor protein assessed as inhi...
In DepthDetails ArticlePubMed
TargetProstaglandin E synthase(Homo sapiens (Human))
Goethe-University Frankfurt
Curated by ChEMBL
LigandPNGBDBM50062731(CHEMBL3397717)
Affinity DataIC50: >1.00E+4nM. Assay description: Inhibition of mPGES-1-mediated PGE2 formation in interleukin-1beta-stimulated human A549 microsomal membranes preincubated for 15 mins before PGH2 ad...
In DepthDetails ArticlePubMed
TargetProstaglandin G/H synthase 1(Ovis aries (Sheep))
Goethe-University Frankfurt
Curated by ChEMBL
LigandPNGBDBM50062731(CHEMBL3397717)
Affinity DataIC50: >1.00E+4nM. Assay description: Inhibition of ovine COX1-mediated 12-HHT formation preincubated for 5 mins before arachidonic acid addition by HPLC analysis
In DepthDetails ArticlePubMed
TargetProstaglandin G/H synthase 2(Homo sapiens (Human))
Goethe-University Frankfurt
Curated by ChEMBL
LigandPNGBDBM50062731(CHEMBL3397717)
Affinity DataIC50: >1.00E+4nM. Assay description: Inhibition of human recombinant COX2-mediated 12-HHT formation preincubated for 5 mins before arachidonic acid addition by HPLC analysis
In DepthDetails ArticlePubMed
TargetPeroxisome proliferator-activated receptor gamma(Homo sapiens (Human))
Goethe-University Frankfurt
Curated by ChEMBL
LigandPNGBDBM50062731(CHEMBL3397717)
Affinity DataEC50:  4.64E+3nM. Assay description: Activation of human PPARgamma ligand binding domain expressed in COS7 cells by dual luciferase reporter gene assay
In DepthDetails ArticlePubMed