BDBM50062846 2,2-Dimethyl-3-(3,7,12,19-tetramethyl-16-vinyl-icosa-3,7,11,15,18-pentaenyl)-oxirane::CHEMBL151911
SMILES [#6]\[#6](-[#6])=[#6]\[#6]\[#6](-[#6]=[#6])=[#6]/[#6]-[#6]-[#6](-[#6])=[#6]-[#6]-[#6]-[#6]=[#6](-[#6])-[#6]-[#6]-[#6]=[#6](-[#6])-[#6]-[#6]-[#6]1-[#8]C1([#6])[#6]
InChI Key InChIKey=IQVZGUNZGFTGLM-GVNHVRHJSA-N
Data  2 IC50
  Tab Delimited (TSV)   2D SDfile   Computed 3D by Vconf -m prep SDfile
Find this compound or compounds like it in BindingDB:
Activity Spreadsheet -- Enzyme Inhibition Constant Data from BindingDB
Found 2 hits for monomerid = 50062846
TargetLanosterol synthase(Homo sapiens (Human))
Università
Curated by ChEMBL
LigandPNGBDBM50062846(2,2-Dimethyl-3-(3,7,12,19-tetramethyl-16-vinyl-ico...)
Affinity DataIC50:  1.80E+4nM. Assay description: Compound was tested for inhibition of solubilized and partially purified Saccharomyces cerevisae Oxidosqualene-lanosterol cyclase
In DepthDetails ArticlePubMed
TargetLanosterol synthase(Rattus norvegicus)
Università
Curated by ChEMBL
LigandPNGBDBM50062846(2,2-Dimethyl-3-(3,7,12,19-tetramethyl-16-vinyl-ico...)
Affinity DataIC50:  3.20E+4nM. Assay description: Compound was tested for inhibition of solubilized and partially purified pig liver Oxidosqualene-lanosterol cyclase
In DepthDetails ArticlePubMed