BDBM50062851 2,2-Dimethyl-3-(3,7,12-trimethyl-hexadeca-3,7,11,15-tetraenyl)-oxirane::CHEMBL152273
SMILES CC(CCC=C)=CCCC=C(C)CCC=C(C)CCC1OC1(C)C
InChI Key InChIKey=KKPVZFWZUKNIDR-RVXWWGNGSA-N
Data  2 IC50
  Tab Delimited (TSV)   2D SDfile   Computed 3D by Vconf -m prep SDfile
Find this compound or compounds like it in BindingDB:
Activity Spreadsheet -- Enzyme Inhibition Constant Data from BindingDB
Found 2 hits for monomerid = 50062851
TargetLanosterol synthase(Homo sapiens (Human))
Università
Curated by ChEMBL
LigandPNGBDBM50062851(2,2-Dimethyl-3-(3,7,12-trimethyl-hexadeca-3,7,11,1...)
Affinity DataIC50:  7.00E+4nM. Assay description: Compound was tested for inhibition of solubilized and partially purified Saccharomyces cerevisae Oxidosqualene-lanosterol cyclase
In DepthDetails ArticlePubMed
TargetLanosterol synthase(Rattus norvegicus)
Università
Curated by ChEMBL
LigandPNGBDBM50062851(2,2-Dimethyl-3-(3,7,12-trimethyl-hexadeca-3,7,11,1...)
Affinity DataIC50:  1.50E+4nM. Assay description: Compound was tested for inhibition of solubilized and partially purified pig liver Oxidosqualene-lanosterol cyclase
In DepthDetails ArticlePubMed