BDBM50063252 CHEMBL3398433
SMILES Cc1oc(nc1CCOc1cccc(c1)[C@H]1CN(C[C@@H]1CC(O)=O)C(=O)Oc1ccccc1)-c1ccccc1
InChI Key InChIKey=VXSVTNCTNBQEQS-RPLLCQBOSA-N
Data  2 IC50  2 EC50
  Tab Delimited (TSV)   2D SDfile   Computed 3D by Vconf -m prep SDfile
Find this compound or compounds like it in BindingDB:
Activity Spreadsheet -- Enzyme Inhibition Constant Data from BindingDB
Found 4 hits for monomerid = 50063252
TargetPeroxisome proliferator-activated receptor alpha(Homo sapiens (Human))
Bristol-Myers Squibb Research And Development (R & D)
Curated by ChEMBL
LigandPNGBDBM50063252(CHEMBL3398433)
Affinity DataEC50:  1.17E+4nM. Assay description: Agonist activity at GAL4 tagged human PPARalpha ligand binding domain expressed in HEK293 cells by luciferase reporter gene assay
In DepthDetails ArticlePubMed
TargetPeroxisome proliferator-activated receptor alpha(Homo sapiens (Human))
Bristol-Myers Squibb Research And Development (R & D)
Curated by ChEMBL
LigandPNGBDBM50063252(CHEMBL3398433)
Affinity DataIC50: >1.00E+4nM. Assay description: Binding affinity to PPARalpha (unknown origin) using fluorescein-tagged dual PPARalpha/gamma activator by homogeneous fluorescence polarization bindi...
In DepthDetails ArticlePubMed
TargetPeroxisome proliferator-activated receptor gamma(Homo sapiens (Human))
Bristol-Myers Squibb Research And Development (R & D)
Curated by ChEMBL
LigandPNGBDBM50063252(CHEMBL3398433)
Affinity DataIC50:  1.82E+3nM. Assay description: Binding affinity to PPARgamma (unknown origin) using fluorescein-tagged dual PPARalpha/gamma activator by homogeneous fluorescence polarization bindi...
In DepthDetails ArticlePubMed
TargetPeroxisome proliferator-activated receptor gamma(Homo sapiens (Human))
Bristol-Myers Squibb Research And Development (R & D)
Curated by ChEMBL
LigandPNGBDBM50063252(CHEMBL3398433)
Affinity DataEC50:  1.46E+4nM. Assay description: Agonist activity at GAL4 tagged human PPARgamma ligand binding domain expressed in HEK293 cells by luciferase reporter gene assay
In DepthDetails ArticlePubMed