BDBM50063309 CHEMBL3398436
SMILES CCOC(=O)N1C[C@@H](Cc2cccc(OCCc3nc(oc3C)-c3ccccc3)c2)[C@H](C1)C(O)=O
InChI Key InChIKey=BTIWHXHFOSRWAP-GGAORHGYSA-N
Data  4 IC50  4 EC50
  Tab Delimited (TSV)   2D SDfile   Computed 3D by Vconf -m prep SDfile
Find this compound or compounds like it in BindingDB:
Activity Spreadsheet -- Enzyme Inhibition Constant Data from BindingDB
Found 8 hits for monomerid = 50063309
TargetPeroxisome proliferator-activated receptor alpha(Homo sapiens (Human))
Bristol-Myers Squibb Research And Development (R & D)
Curated by ChEMBL
LigandPNGBDBM50063309(CHEMBL3398436)
Affinity DataEC50:  10nM. Assay description: Agonist activity at GAL4 tagged human PPARalpha ligand binding domain expressed in HEK293 cells by luciferase reporter gene assay
In DepthDetails ArticlePubMed
TargetPeroxisome proliferator-activated receptor gamma(Homo sapiens (Human))
Bristol-Myers Squibb Research And Development (R & D)
Curated by ChEMBL
LigandPNGBDBM50063309(CHEMBL3398436)
Affinity DataEC50:  9nM. Assay description: Agonist activity at GAL4 tagged human PPARgamma ligand binding domain expressed in HEK293 cells by luciferase reporter gene assay
In DepthDetails ArticlePubMed
TargetPeroxisome proliferator-activated receptor gamma(Homo sapiens (Human))
Bristol-Myers Squibb Research And Development (R & D)
Curated by ChEMBL
LigandPNGBDBM50063309(CHEMBL3398436)
Affinity DataEC50:  9nM. Assay description: Agonist activity at GAL4 tagged human PPARgamma ligand binding domain expressed in HEK293 cells by luciferase reporter gene assay
In DepthDetails ArticlePubMed
TargetPeroxisome proliferator-activated receptor alpha(Homo sapiens (Human))
Bristol-Myers Squibb Research And Development (R & D)
Curated by ChEMBL
LigandPNGBDBM50063309(CHEMBL3398436)
Affinity DataEC50:  10nM. Assay description: Agonist activity at GAL4 tagged human PPARalpha ligand binding domain expressed in HEK293 cells by luciferase reporter gene assay
In DepthDetails ArticlePubMed
TargetPeroxisome proliferator-activated receptor gamma(Homo sapiens (Human))
Bristol-Myers Squibb Research And Development (R & D)
Curated by ChEMBL
LigandPNGBDBM50063309(CHEMBL3398436)
Affinity DataIC50:  1.51E+3nM. Assay description: Binding affinity to PPARgamma (unknown origin) using fluorescein-tagged dual PPARalpha/gamma activator by homogeneous fluorescence polarization bindi...
In DepthDetails ArticlePubMed
TargetPeroxisome proliferator-activated receptor alpha(Homo sapiens (Human))
Bristol-Myers Squibb Research And Development (R & D)
Curated by ChEMBL
LigandPNGBDBM50063309(CHEMBL3398436)
Affinity DataIC50:  170nM. Assay description: Binding affinity to PPARalpha (unknown origin) using fluorescein-tagged dual PPARalpha/gamma activator by homogeneous fluorescence polarization bindi...
In DepthDetails ArticlePubMed
TargetPeroxisome proliferator-activated receptor alpha(Homo sapiens (Human))
Bristol-Myers Squibb Research And Development (R & D)
Curated by ChEMBL
LigandPNGBDBM50063309(CHEMBL3398436)
Affinity DataIC50:  170nM. Assay description: Binding affinity to PPARalpha (unknown origin) using fluorescein-tagged dual PPARalpha/gamma activator by homogeneous fluorescence polarization bindi...
In DepthDetails ArticlePubMed
TargetPeroxisome proliferator-activated receptor gamma(Homo sapiens (Human))
Bristol-Myers Squibb Research And Development (R & D)
Curated by ChEMBL
LigandPNGBDBM50063309(CHEMBL3398436)
Affinity DataIC50:  1.51E+3nM. Assay description: Binding affinity to PPARgamma (unknown origin) using fluorescein-tagged dual PPARalpha/gamma activator by homogeneous fluorescence polarization bindi...
In DepthDetails ArticlePubMed