BDBM50063490 CHEMBL3398458
SMILES CCOC(=O)N1C[C@@H](CCc2ccc(OCCc3nc(oc3C)-c3ccccc3)cc2)[C@H](C1)C(O)=O
InChI Key InChIKey=WBGQHZPOWQGORY-VWNXMTODSA-N
Data  2 IC50  2 EC50
  Tab Delimited (TSV)   2D SDfile   Computed 3D by Vconf -m prep SDfile
Find this compound or compounds like it in BindingDB:
Activity Spreadsheet -- Enzyme Inhibition Constant Data from BindingDB
Found 4 hits for monomerid = 50063490
TargetPeroxisome proliferator-activated receptor alpha(Homo sapiens (Human))
Bristol-Myers Squibb Research And Development (R & D)
Curated by ChEMBL
LigandPNGBDBM50063490(CHEMBL3398458)
Affinity DataEC50:  20nM. Assay description: Agonist activity at GAL4 tagged human PPARalpha ligand binding domain expressed in HEK293 cells by luciferase reporter gene assay
In DepthDetails ArticlePubMed
TargetPeroxisome proliferator-activated receptor gamma(Homo sapiens (Human))
Bristol-Myers Squibb Research And Development (R & D)
Curated by ChEMBL
LigandPNGBDBM50063490(CHEMBL3398458)
Affinity DataIC50:  690nM. Assay description: Binding affinity to PPARgamma (unknown origin) using fluorescein-tagged dual PPARalpha/gamma activator by homogeneous fluorescence polarization bindi...
In DepthDetails ArticlePubMed
TargetPeroxisome proliferator-activated receptor gamma(Homo sapiens (Human))
Bristol-Myers Squibb Research And Development (R & D)
Curated by ChEMBL
LigandPNGBDBM50063490(CHEMBL3398458)
Affinity DataEC50:  540nM. Assay description: Agonist activity at GAL4 tagged human PPARgamma ligand binding domain expressed in HEK293 cells by luciferase reporter gene assay
In DepthDetails ArticlePubMed
TargetPeroxisome proliferator-activated receptor alpha(Homo sapiens (Human))
Bristol-Myers Squibb Research And Development (R & D)
Curated by ChEMBL
LigandPNGBDBM50063490(CHEMBL3398458)
Affinity DataIC50:  3.27E+3nM. Assay description: Binding affinity to PPARalpha (unknown origin) using fluorescein-tagged dual PPARalpha/gamma activator by homogeneous fluorescence polarization bindi...
In DepthDetails ArticlePubMed