BDBM50063805 6-Benzoyl-3-(2-pyrrolidin-1-yl-ethyl)-3H-benzothiazol-2-one::CHEMBL15288
SMILES O=C(c1ccccc1)c1ccc2n(CCN3CCCC3)c(=O)sc2c1
InChI Key InChIKey=XECMJAXOJJUDRA-UHFFFAOYSA-N
Data  1 KI
  Tab Delimited (TSV)   2D SDfile   Computed 3D by Vconf -m prep SDfile
Find this compound or compounds like it in BindingDB:
Activity Spreadsheet -- Enzyme Inhibition Constant Data from BindingDB
Found 1 hit for monomerid = 50063805
TargetSigma non-opioid intracellular receptor 1(Homo sapiens (Human))
University Of Louvain
Curated by ChEMBL
LigandPNGBDBM50063805(6-Benzoyl-3-(2-pyrrolidin-1-yl-ethyl)-3H-benzothia...)
Affinity DataKi:  54nM. Assay description: The compound was tested for the affinity on sigma 1 receptor using [3H]- pentazocine as radioligand
In DepthDetails ArticlePubMed