BDBM50065409 (S)-3-((R)-3-Benzyloxy-2-methanesulfonylamino-propionylamino)-N-ethyl-2-oxo-4-phenyl-butyramide::CHEMBL80553
SMILES CCNC(=O)C(=O)[C@H](Cc1ccccc1)NC(=O)[C@@H](COCc1ccccc1)NS(C)(=O)=O
InChI Key InChIKey=LFYDTNGNBDVIGD-VQTJNVASSA-N
Data  2 KI
  Tab Delimited (TSV)   2D SDfile   Computed 3D by Vconf -m prep SDfile
Find this compound or compounds like it in BindingDB:
Activity Spreadsheet -- Enzyme Inhibition Constant Data from BindingDB
Found 2 hits for monomerid = 50065409
TargetCalpain-1 catalytic subunit(Homo sapiens (Human))
Cephalon
Curated by ChEMBL
LigandPNGBDBM50065409((S)-3-((R)-3-Benzyloxy-2-methanesulfonylamino-prop...)
Affinity DataKi:  130nM. Assay description: Inhibitory activity against recombinant human Calpain-I receptor
In DepthDetails ArticlePubMed
TargetCalpain-1 catalytic subunit(Homo sapiens (Human))
Cephalon
Curated by ChEMBL
LigandPNGBDBM50065409((S)-3-((R)-3-Benzyloxy-2-methanesulfonylamino-prop...)
Affinity DataKi:  130nM. Assay description: Inhibitory activity against recombinant human calpain I
In DepthDetails ArticlePubMed