BDBM50066298 2-Fluoro-benzoic acid N'-(2-fluoro-benzoyl)-hydrazide::CHEMBL110831
SMILES Fc1ccccc1C(=O)NNC(=O)c1ccccc1F
InChI Key InChIKey=YHTGZECLQXBTHD-UHFFFAOYSA-N
Data  2 IC50
  Tab Delimited (TSV)   2D SDfile   Computed 3D by Vconf -m prep SDfile
Find this compound or compounds like it in BindingDB:
Activity Spreadsheet -- Enzyme Inhibition Constant Data from BindingDB
Found 2 hits for monomerid = 50066298
TargetIntegrase(Human immunodeficiency virus 1)
National Cancer Institute-Bethesda
Curated by ChEMBL
LigandPNGBDBM50066298(2-Fluoro-benzoic acid N'-(2-fluoro-benzoyl)-hydraz...)
Affinity DataIC50: >1.00E+5nM. Assay description: Inhibition of HIV-1 integrase enzyme at 3`- processing stage of DNA integration
In DepthDetails ArticlePubMed
TargetIntegrase(Human immunodeficiency virus 1)
National Cancer Institute-Bethesda
Curated by ChEMBL
LigandPNGBDBM50066298(2-Fluoro-benzoic acid N'-(2-fluoro-benzoyl)-hydraz...)
Affinity DataIC50: >1.00E+5nM. Assay description: Inhibitory concentration as 50% inhibition of HIV-1 integrase enzyme at strand transfer stage of DNA integration.
In DepthDetails ArticlePubMed