BDBM50066319 4-Chloro-benzoic acid N'-(3,4,5-trimethoxy-benzoyl)-hydrazide::CHEMBL108310
SMILES COc1cc(cc(OC)c1OC)C(=O)NNC(=O)c1ccc(Cl)cc1
InChI Key InChIKey=YBLRHBAFJNOOGX-UHFFFAOYSA-N
Data  2 IC50
  Tab Delimited (TSV)   2D SDfile   Computed 3D by Vconf -m prep SDfile
Find this compound or compounds like it in BindingDB:
Activity Spreadsheet -- Enzyme Inhibition Constant Data from BindingDB
Found 2 hits for monomerid = 50066319
TargetIntegrase(Human immunodeficiency virus 1)
National Cancer Institute-Bethesda
Curated by ChEMBL
LigandPNGBDBM50066319(4-Chloro-benzoic acid N'-(3,4,5-trimethoxy-benzoyl...)
Affinity DataIC50: >1.00E+5nM. Assay description: Inhibitory concentration as 50% inhibition of HIV-1 integrase enzyme at strand transfer stage of DNA integration.
In DepthDetails ArticlePubMed
TargetIntegrase(Human immunodeficiency virus 1)
National Cancer Institute-Bethesda
Curated by ChEMBL
LigandPNGBDBM50066319(4-Chloro-benzoic acid N'-(3,4,5-trimethoxy-benzoyl...)
Affinity DataIC50: >1.00E+5nM. Assay description: Inhibition of HIV-1 integrase enzyme at 3`- processing stage of DNA integration
In DepthDetails ArticlePubMed