BDBM50067288 4-{(E)-2-[({[2,4-Dichloro-3-(2-methyl-benzooxazol-4-yloxymethyl)-phenyl]-methyl-carbamoyl}-methyl)-carbamoyl]-vinyl}-N-methyl-benzamide::CHEMBL43510
SMILES CNC(=O)c1ccc(\C=C\C(=O)NCC(=O)N(C)c2ccc(Cl)c(COc3cccc4oc(C)nc34)c2Cl)cc1
InChI Key InChIKey=YGCJXJRNIIUTAT-NTEUORMPSA-N
Data  5 IC50
  Tab Delimited (TSV)   2D SDfile   Computed 3D by Vconf -m prep SDfile
Find this compound or compounds like it in BindingDB:
Activity Spreadsheet -- Enzyme Inhibition Constant Data from BindingDB
Found 5 hits for monomerid = 50067288
TargetB2 bradykinin receptor(Homo sapiens (Human))
Fujisawa Pharmaceutical
Curated by ChEMBL
LigandPNGBDBM50067288(4-{(E)-2-[({[2,4-Dichloro-3-(2-methyl-benzooxazol-...)
Affinity DataIC50:  1.10E+3nM. Assay description: Inhibition specific binding of [3H]BK (1.0 nM) to human Bradykinin receptor B2 which was expressed in CHO (Chinese hamster ovary) cells by 50%.
In DepthDetails ArticlePubMed
TargetB2 bradykinin receptor(Cavia porcellus)
Fujisawa Pharmaceutical
Curated by ChEMBL
LigandPNGBDBM50067288(4-{(E)-2-[({[2,4-Dichloro-3-(2-methyl-benzooxazol-...)
Affinity DataIC50:  380nM. Assay description: Concentration required to inhibit specific binding of [ 3H]BK (0.06 nM) to Bradykinin receptor B2 in guinea pig ileum membrane preparations by 50%.
In DepthDetails ArticlePubMed
TargetB2 bradykinin receptor(Homo sapiens (Human))
Fujisawa Pharmaceutical
Curated by ChEMBL
LigandPNGBDBM50067288(4-{(E)-2-[({[2,4-Dichloro-3-(2-methyl-benzooxazol-...)
Affinity DataIC50:  1.10E+3nM. Assay description: In vitro inhibitory activity towards human bradykinin receptor B2 expressed in CHO cells using [3H]BK (1.0 nM) as a radioligand
In DepthDetails ArticlePubMed
TargetB2 bradykinin receptor(Homo sapiens (Human))
Fujisawa Pharmaceutical
Curated by ChEMBL
LigandPNGBDBM50067288(4-{(E)-2-[({[2,4-Dichloro-3-(2-methyl-benzooxazol-...)
Affinity DataIC50:  380nM. Assay description: In vitro inhibitory activity towards bradykinin receptor B2 using [3H]BK (0.06 nM) as a radioligand in guinea pig ileum membrane preparation
In DepthDetails ArticlePubMed
TargetB2 bradykinin receptor(Homo sapiens (Human))
Fujisawa Pharmaceutical
Curated by ChEMBL
LigandPNGBDBM50067288(4-{(E)-2-[({[2,4-Dichloro-3-(2-methyl-benzooxazol-...)
Affinity DataIC50:  860nM. Assay description: Concentration required to inhibit specific binding of [3H]BK (1.2 nM) to A-431 cells (human epidermoidcarcinoma) which express Bradykinin receptor B2...
In DepthDetails ArticlePubMed