BDBM50068813 CHEMBL149962::N-(4-Carboxy-4-{4-[(2,4-diamino-pyrido[2,3-d]pyrimidin-6-ylmethyl)-amino]-benzoylamino}-butyl)-phthalamic acid
SMILES Nc1nc(N)c2cc(CNc3ccc(cc3)C(=O)NC(CCCNC(=O)c3ccccc3C(O)=O)C(O)=O)cnc2n1
InChI Key InChIKey=YBVDCOUCOVSDIG-UHFFFAOYSA-N
Data  1 KI
  Tab Delimited (TSV)   2D SDfile   Computed 3D by Vconf -m prep SDfile
Find this compound or compounds like it in BindingDB:
Activity Spreadsheet -- Enzyme Inhibition Constant Data from BindingDB
Found 1 hit for monomerid = 50068813
TargetDihydrofolate reductase(Homo sapiens (Human))
Harvard Medical School
Curated by ChEMBL
LigandPNGBDBM50068813(CHEMBL149962 | N-(4-Carboxy-4-{4-[(2,4-diamino-pyr...)
Affinity DataKi:  0nM. Assay description: Compound was evaluated for the inhibition of Dihydrofolate reductase at concentration ranged from 0.15-0.50 uM
In DepthDetails ArticlePubMed