BDBM50069328 CHEMBL3403539::US9688661, 4-(6-aminopyrimidin-4-yl)-1-(5-chloro-2-methylphenyl)-1H-pyrrole-2-carboxamide (compd 227)
SMILES Cc1ccc(Cl)cc1-n1cc(cc1C(N)=O)-c1cc(N)ncn1
InChI Key InChIKey=KZJLFVSFVDUMIS-UHFFFAOYSA-N
Data  3 IC50
  Tab Delimited (TSV)   2D SDfile   Computed 3D by Vconf -m prep SDfile
Find this compound or compounds like it in BindingDB:
Activity Spreadsheet -- Enzyme Inhibition Constant Data from BindingDB
Found 3 hits for monomerid = 50069328
TargetTyrosine-protein kinase JAK2(Homo sapiens (Human))
Nerviano Medical Sciences
Curated by ChEMBL
LigandPNGBDBM50069328(CHEMBL3403539 | US9688661, 4-(6-aminopyrimidin-4-y...)
Affinity DataIC50:  73nM. Assay description: Inhibition of recombinant epitope-tagged JAK2 (808 to 1132) (unknown origin) using LPLDKDYYVVREPGQ as substrate by beta-countiing analysis in presenc...
In DepthDetails ArticlePubMed
TargetTyrosine-protein kinase JAK2(Homo sapiens (Human))
Nerviano Medical Sciences
Curated by ChEMBL
LigandPNGBDBM50069328(CHEMBL3403539 | US9688661, 4-(6-aminopyrimidin-4-y...)
Affinity DataIC50:  73nM. Assay description: Assays were performed with the commercially available JAK2 kinase domain (Invitrogen, Eugene, Oreg.) that showed a linear kinetic without prephosphor...
In DepthDetails US Patent
TargetTyrosine-protein kinase JAK1 [861-1152](Homo sapiens (Human))
Nerviano Medical Sciences
US Patent
LigandPNGBDBM50069328(CHEMBL3403539 | US9688661, 4-(6-aminopyrimidin-4-y...)
Affinity DataIC50:  595nM. Assay description: Assays were performed with the JAK1 kinase domain (residues 861-1152 of the 1154 amino acid long full-length sequence, accession number P23458 of Uni...
In DepthDetails US Patent