BDBM50071121 CHEMBL301437::N-{2-(3,4-Dichloro-phenyl)-4-[4-(1-hydroxy-1-methyl-ethyl)-piperidin-1-yl]-butyl}-N-methyl-benzamide
SMILES CN(CC(CCN1CCC(CC1)C(C)(C)O)c1ccc(Cl)c(Cl)c1)C(=O)c1ccccc1
InChI Key InChIKey=DAJSDTWHSJMFGK-UHFFFAOYSA-N
Data  1 KI
  Tab Delimited (TSV)   2D SDfile   Computed 3D by Vconf -m prep SDfile
Find this compound or compounds like it in BindingDB:
Activity Spreadsheet -- Enzyme Inhibition Constant Data from BindingDB
Found 1 hit for monomerid = 50071121
TargetSubstance-K receptor(Homo sapiens (Human))
Zeneca Pharmaceuticals
Curated by ChEMBL
LigandPNGBDBM50071121(CHEMBL301437 | N-{2-(3,4-Dichloro-phenyl)-4-[4-(1-...)
Affinity DataKi:  7.70nM. Assay description: Displacement of [3H]- NKA from human NK-2 receptor expressed in MEL cells
In DepthDetails ArticlePubMed