BDBM50071124 CHEMBL56739::N-{2-(3,4-Dichloro-phenyl)-4-[4-(1-hydroxy-propyl)-piperidin-1-yl]-butyl}-N-methyl-benzamide
SMILES CCC(O)C1CCN(CCC(CN(C)C(=O)c2ccccc2)c2ccc(Cl)c(Cl)c2)CC1
InChI Key InChIKey=KRMCSHVGYGBUFB-UHFFFAOYSA-N
Data  1 KI
  Tab Delimited (TSV)   2D SDfile   Computed 3D by Vconf -m prep SDfile
Find this compound or compounds like it in BindingDB:
Activity Spreadsheet -- Enzyme Inhibition Constant Data from BindingDB
Found 1 hit for monomerid = 50071124
TargetSubstance-K receptor(Homo sapiens (Human))
Zeneca Pharmaceuticals
Curated by ChEMBL
LigandPNGBDBM50071124(CHEMBL56739 | N-{2-(3,4-Dichloro-phenyl)-4-[4-(1-h...)
Affinity DataKi:  13nM. Assay description: Displacement of [3H]- NKA from human NK-2 receptor expressed in MEL cells
In DepthDetails ArticlePubMed