BDBM50071432 (S)-2-[(R)-2-[(3,5-Dimethyl-benzoyl)-methyl-amino]-3-(4-thiophen-2-yl-phenyl)-propionylamino]-3-(1H-indol-3-yl)-propionic acid::CHEMBL307470
SMILES CN([C@H](Cc1ccc(cc1)-c1cccs1)C(=O)N[C@@H](Cc1c[nH]c2ccccc12)C(O)=O)C(=O)c1cc(C)cc(C)c1
InChI Key InChIKey=CFTTVXIBXXPWEU-XZWHSSHBSA-N
Data  2 KI
  Tab Delimited (TSV)   2D SDfile   Computed 3D by Vconf -m prep SDfile
Find this compound or compounds like it in BindingDB:
Activity Spreadsheet -- Enzyme Inhibition Constant Data from BindingDB
Found 2 hits for monomerid = 50071432
TargetEndothelin receptor type B(Homo sapiens (Human))
Takarazuka Research Institute
Curated by ChEMBL
LigandPNGBDBM50071432((S)-2-[(R)-2-[(3,5-Dimethyl-benzoyl)-methyl-amino]...)
Affinity DataKi:  0.600nM. Assay description: Binding affinity to Endothelin B receptor
In DepthDetails ArticlePubMed
TargetEndothelin-1 receptor(Homo sapiens (Human))
Takarazuka Research Institute
Curated by ChEMBL
LigandPNGBDBM50071432((S)-2-[(R)-2-[(3,5-Dimethyl-benzoyl)-methyl-amino]...)
Affinity DataKi:  87nM. Assay description: Binding affinity to Endothelin A receptor
In DepthDetails ArticlePubMed