BDBM50071441 (S)-2-[(R)-2-[(3,5-Dimethyl-benzoyl)-methyl-amino]-3-(4-furan-2-yl-phenyl)-propionylamino]-3-(1H-indol-3-yl)-propionic acid::CHEMBL70686
SMILES CN([C@H](Cc1ccc(cc1)-c1ccco1)C(=O)N[C@@H](Cc1c[nH]c2ccccc12)C(O)=O)C(=O)c1cc(C)cc(C)c1
InChI Key InChIKey=RDVHLMJRZJBHMF-XZWHSSHBSA-N
Data  2 KI
  Tab Delimited (TSV)   2D SDfile   Computed 3D by Vconf -m prep SDfile
Find this compound or compounds like it in BindingDB:
Activity Spreadsheet -- Enzyme Inhibition Constant Data from BindingDB
Found 2 hits for monomerid = 50071441
TargetEndothelin receptor type B(Homo sapiens (Human))
Takarazuka Research Institute
Curated by ChEMBL
LigandPNGBDBM50071441((S)-2-[(R)-2-[(3,5-Dimethyl-benzoyl)-methyl-amino]...)
Affinity DataKi:  0.760nM. Assay description: Binding affinity to Endothelin B receptor
In DepthDetails ArticlePubMed
TargetEndothelin-1 receptor(Homo sapiens (Human))
Takarazuka Research Institute
Curated by ChEMBL
LigandPNGBDBM50071441((S)-2-[(R)-2-[(3,5-Dimethyl-benzoyl)-methyl-amino]...)
Affinity DataKi:  250nM. Assay description: Binding affinity to Endothelin A receptor
In DepthDetails ArticlePubMed