BDBM50072603 CHEMBL3409574
SMILES OCC(c1cccc(Cl)c1)n1ccc(cc1=O)-c1ccnc(NC2CCOCC2)n1
InChI Key InChIKey=GBUFGAHGZPUUTQ-UHFFFAOYSA-N
Data  1 KI
  Tab Delimited (TSV)   2D SDfile   Computed 3D by Vconf -m prep SDfile
Find this compound or compounds like it in BindingDB:
Activity Spreadsheet -- Enzyme Inhibition Constant Data from BindingDB
Found 1 hit for monomerid = 50072603
TargetMitogen-activated protein kinase 1(Homo sapiens (Human))
Array Biopharma
Curated by ChEMBL
LigandPNGBDBM50072603(CHEMBL3409574)
Affinity DataKi:  1.30nM. Assay description: Inhibition of 6-His tagged human ERK2 expressed in Escherichia coli measured over 30 mins by competition assay
In DepthDetails ArticlePubMed