BDBM50073116 CHEMBL3410952
SMILES Cc1c(C)c2OC(C)(CCc2c(C)c1O)C(=O)NCCCCNc1c2CCCCc2nc2ccccc12
InChI Key InChIKey=AGELYORQPXWSGA-UHFFFAOYSA-N
Data  6 IC50
  Tab Delimited (TSV)   2D SDfile   Computed 3D by Vconf -m prep SDfile
Find this compound or compounds like it in BindingDB:
Activity Spreadsheet -- Enzyme Inhibition Constant Data from BindingDB
Found 6 hits for monomerid = 50073116
TargetCholinesterase(Homo sapiens (Human))
China Pharmaceutical University
Curated by ChEMBL
LigandPNGBDBM50073116(CHEMBL3410952)
Affinity DataIC50:  5.20nM. Assay description: Inhibition of human serum BuChE using S-butyrylthiocholine iodide as substrate preincubated for 6 mins before substrate addition by Ellman's method
In DepthDetails ArticlePubMed
TargetAcetylcholinesterase(Homo sapiens (Human))
China Pharmaceutical University
Curated by ChEMBL
LigandPNGBDBM50073116(CHEMBL3410952)
Affinity DataIC50:  535nM. Assay description: Inhibition of human erythrocyte AChE using acetylthiocholine iodide as substrate preincubated for 6 mins before substrate addition by Ellman's method
In DepthDetails ArticlePubMed
TargetCholinesterase(Homo sapiens (Human))
China Pharmaceutical University
Curated by ChEMBL
LigandPNGBDBM50073116(CHEMBL3410952)
Affinity DataIC50:  80nM. Assay description: Inhibition of human plasmatic BChE using butyrylthiocholine as substrate preincubated for 5 mins followed by substrate addition measured every 2 mins...
In DepthDetails ArticlePubMed
TargetAcetylcholinesterase(Electrophorus electricus (Electric eel))
China Pharmaceutical University
Curated by ChEMBL
LigandPNGBDBM50073116(CHEMBL3410952)
Affinity DataIC50:  558nM. Assay description: Inhibition of electric eel AChE using acetylthiocholine iodide as substrate preincubated for 6 mins before substrate addition by Ellman's method
In DepthDetails ArticlePubMed
TargetAcetylcholinesterase(Homo sapiens (Human))
China Pharmaceutical University
Curated by ChEMBL
LigandPNGBDBM50073116(CHEMBL3410952)
Affinity DataIC50:  950nM. Assay description: Inhibition of human recombinant AChE using acetylthiocholine as substrate preincubated for 5 mins followed by substrate addition measured every 2 min...
In DepthDetails ArticlePubMed
TargetCholinesterase(Equus caballus (Horse))
China Pharmaceutical University
Curated by ChEMBL
LigandPNGBDBM50073116(CHEMBL3410952)
Affinity DataIC50:  16nM. Assay description: Inhibition of equine serum BuChE using S-butyrylthiocholine iodide as substrate preincubated for 6 mins before substrate addition by Ellman's method
In DepthDetails ArticlePubMed