BDBM50074398 (2-Bromo-4-ethyl-phenyl)-(4,6-dimethyl-pyrimidin-2-yl)-methyl-amine::CHEMBL166102
SMILES CCc1ccc(N(C)c2nc(C)cc(C)n2)c(Br)c1
InChI Key InChIKey=BJBJQLPFJLBRHO-UHFFFAOYSA-N
Data  1 KI
  Tab Delimited (TSV)   2D SDfile   Computed 3D by Vconf -m prep SDfile
Find this compound or compounds like it in BindingDB:
Activity Spreadsheet -- Enzyme Inhibition Constant Data from BindingDB
Found 1 hit for monomerid = 50074398
TargetCorticotropin-releasing factor receptor 1(Rattus norvegicus (rat))
Dupont Pharmaceuticals
Curated by ChEMBL
LigandPNGBDBM50074398((2-Bromo-4-ethyl-phenyl)-(4,6-dimethyl-pyrimidin-2...)
Affinity DataKi:  187nM. Assay description: Binding affinity of the compound was measured on rat Corticotropin releasing factor receptor 1
In DepthDetails ArticlePubMed