BDBM50075067 ((S)-2-Amino-4-methyl-pentanoyl)-sulfamic acid (2R,3S,4R,5R)-3,4-dihydroxy-5-[4-(4-phenoxy-phenyl)-thiazol-2-yl]-tetrahydro-furan-2-ylmethyl ester::CHEMBL340082
SMILES CC(C)C[C@H](N)C(=O)NS(=O)(=O)OC[C@H]1O[C@H]([C@H](O)[C@@H]1O)c1nc(cs1)-c1ccc(Oc2ccccc2)cc1
InChI Key InChIKey=AGNVQYRHDFXYKF-JGSPDANKSA-N
Data  3 IC50
  Tab Delimited (TSV)   2D SDfile   Computed 3D by Vconf -m prep SDfile
Find this compound or compounds like it in BindingDB:
Activity Spreadsheet -- Enzyme Inhibition Constant Data from BindingDB
Found 3 hits for monomerid = 50075067
TargetIsoleucine--tRNA ligase(Staphylococcus aureus)
Cubist Pharmaceuticals
Curated by ChEMBL
LigandPNGBDBM50075067(((S)-2-Amino-4-methyl-pentanoyl)-sulfamic acid (2R...)
Affinity DataIC50: >54nM. Assay description: Compound tested for the inhibition of S. aureus Leucyl-tRNA synthetase
In DepthDetails ArticlePubMed
TargetLeucine--tRNA ligase, cytoplasmic(Homo sapiens (Human))
Cubist Pharmaceuticals
Curated by ChEMBL
LigandPNGBDBM50075067(((S)-2-Amino-4-methyl-pentanoyl)-sulfamic acid (2R...)
Affinity DataIC50:  1.60nM. Assay description: Compound tested for the inhibition of E. coli Leucyl-tRNA synthetase
In DepthDetails ArticlePubMed
TargetLeucine--tRNA ligase, cytoplasmic(Homo sapiens (Human))
Cubist Pharmaceuticals
Curated by ChEMBL
LigandPNGBDBM50075067(((S)-2-Amino-4-methyl-pentanoyl)-sulfamic acid (2R...)
Affinity DataIC50:  600nM. Assay description: Compound tested for the inhibition of human Leucyl-tRNA synthetase
In DepthDetails ArticlePubMed