BDBM50076427 2-(4-Methyl-piperazin-1-yl)-4-phenyl-3-[2-(tetrahydro-furan-2-yloxy)-ethyl]-quinoline::CHEMBL42911
SMILES CN1CCN(CC1)c1nc2ccccc2c(c1CCOC1CCCO1)-c1ccccc1
InChI Key InChIKey=BALBTHVJTPFUOX-UHFFFAOYSA-N
Data  1 KI
  Tab Delimited (TSV)   2D SDfile   Computed 3D by Vconf -m prep SDfile
Find this compound or compounds like it in BindingDB:
Activity Spreadsheet -- Enzyme Inhibition Constant Data from BindingDB
Found 1 hit for monomerid = 50076427
Target5-hydroxytryptamine receptor 3A/3B(Rattus norvegicus)
Universit£
Curated by ChEMBL
LigandPNGBDBM50076427(2-(4-Methyl-piperazin-1-yl)-4-phenyl-3-[2-(tetrahy...)
Affinity DataKi:  0.800nM. Assay description: Inhibition of [3H]granisetron binding to 5-hydroxytryptamine 3 receptor of rat cortical membrane
In DepthDetails ArticlePubMed