BDBM50076561 3-{5-[4-amino(imino)methylaminobutyl]-4,5-dihydro-3-isoxazolylcarboxamido}-2-(3,5-dimethyl-4-isoxazolylsulfonamido)-(2S)-propanoic acid::CHEMBL173712
SMILES Cc1noc(C)c1S(=O)(=O)N[C@@H](CNC(=O)C1=NOC(CCCCNC(N)=N)C1)C(O)=O
InChI Key InChIKey=MGEHYKCMVRSSIK-YUZLPWPTSA-N
Data  2 IC50
  Tab Delimited (TSV)   2D SDfile   Computed 3D by Vconf -m prep SDfile
Find this compound or compounds like it in BindingDB:
Activity Spreadsheet -- Enzyme Inhibition Constant Data from BindingDB
Found 2 hits for monomerid = 50076561
TargetIntegrin alpha-V/beta-3(Homo sapiens (Human))
Dupont Pharmaceuticals
Curated by ChEMBL
LigandPNGBDBM50076561(3-{5-[4-amino(imino)methylaminobutyl]-4,5-dihydro-...)
Affinity DataIC50:  14nM. Assay description: Antagonistic activity against vitronectin receptor
In DepthDetails ArticlePubMed
TargetIntegrin alpha-IIb/beta-3(Homo sapiens (Human))
Dupont Pharmaceuticals
Curated by ChEMBL
LigandPNGBDBM50076561(3-{5-[4-amino(imino)methylaminobutyl]-4,5-dihydro-...)
Affinity DataIC50:  850nM. Assay description: Antagonistic activity against vitronectin receptor
In DepthDetails ArticlePubMed