BDBM50076566 (S)-2-Benzyloxycarbonylamino-3-[3-(5-guanidinomethyl-4,5-dihydro-isoxazol-3-yl)-propionylamino]-propionic acid::CHEMBL173462
SMILES NC(=N)NCC1CC(CCC(=O)NC[C@H](NC(=O)OCc2ccccc2)C(O)=O)=NO1
InChI Key InChIKey=HFXPPHYQPLJVBN-LOACHALJSA-N
Data  2 IC50
  Tab Delimited (TSV)   2D SDfile   Computed 3D by Vconf -m prep SDfile
Find this compound or compounds like it in BindingDB:
Activity Spreadsheet -- Enzyme Inhibition Constant Data from BindingDB
Found 2 hits for monomerid = 50076566
TargetIntegrin alpha-V/beta-3(Homo sapiens (Human))
Dupont Pharmaceuticals
Curated by ChEMBL
LigandPNGBDBM50076566((S)-2-Benzyloxycarbonylamino-3-[3-(5-guanidinometh...)
Affinity DataIC50:  310nM. Assay description: Antagonistic activity against fibrinogen receptor
In DepthDetails ArticlePubMed
TargetIntegrin alpha-IIb/beta-3(Homo sapiens (Human))
Dupont Pharmaceuticals
Curated by ChEMBL
LigandPNGBDBM50076566((S)-2-Benzyloxycarbonylamino-3-[3-(5-guanidinometh...)
Affinity DataIC50: >1.00E+5nM. Assay description: Antagonistic activity against fibrinogen receptor
In DepthDetails ArticlePubMed