BDBM50076578 (S)-2-Benzyloxycarbonylamino-3-{[3-(2-guanidino-ethyl)-4,5-dihydro-isoxazole-5-carbonyl]-amino}-propionic acid::CHEMBL172014
SMILES NC(=N)NCCC1=NOC(C1)C(=O)NC[C@H](NC(=O)OCc1ccccc1)C(O)=O
InChI Key InChIKey=PWKOHBNSSADNKX-LSLKUGRBSA-N
Data  2 IC50
  Tab Delimited (TSV)   2D SDfile   Computed 3D by Vconf -m prep SDfile
Find this compound or compounds like it in BindingDB:
Activity Spreadsheet -- Enzyme Inhibition Constant Data from BindingDB
Found 2 hits for monomerid = 50076578
TargetIntegrin alpha-IIb/beta-3(Homo sapiens (Human))
Dupont Pharmaceuticals
Curated by ChEMBL
LigandPNGBDBM50076578((S)-2-Benzyloxycarbonylamino-3-{[3-(2-guanidino-et...)
Affinity DataIC50: >1.00E+5nM. Assay description: Antagonistic activity against fibrinogen receptor
In DepthDetails ArticlePubMed
TargetIntegrin alpha-V/beta-3(Homo sapiens (Human))
Dupont Pharmaceuticals
Curated by ChEMBL
LigandPNGBDBM50076578((S)-2-Benzyloxycarbonylamino-3-{[3-(2-guanidino-et...)
Affinity DataIC50:  2.60E+3nM. Assay description: Antagonistic activity against fibrinogen receptor
In DepthDetails ArticlePubMed