BDBM50076586 (S)-2-Benzyloxycarbonylamino-3-{[3-(3-guanidino-propyl)-4,5-dihydro-isoxazole-5-carbonyl]-amino}-propionic acid::CHEMBL408665
SMILES NC(=N)NCCCC1=NOC(C1)C(=O)NC[C@H](NC(=O)OCc1ccccc1)C(O)=O
InChI Key InChIKey=JMQNFFYUIIKTRK-MLCCFXAWSA-N
Data  2 IC50
  Tab Delimited (TSV)   2D SDfile   Computed 3D by Vconf -m prep SDfile
Find this compound or compounds like it in BindingDB:
Activity Spreadsheet -- Enzyme Inhibition Constant Data from BindingDB
Found 2 hits for monomerid = 50076586
TargetIntegrin alpha-IIb/beta-3(Homo sapiens (Human))
Dupont Pharmaceuticals
Curated by ChEMBL
LigandPNGBDBM50076586((S)-2-Benzyloxycarbonylamino-3-{[3-(3-guanidino-pr...)
Affinity DataIC50: >1.00E+5nM. Assay description: Antagonistic activity against fibrinogen receptor
In DepthDetails ArticlePubMed
TargetIntegrin alpha-V/beta-3(Homo sapiens (Human))
Dupont Pharmaceuticals
Curated by ChEMBL
LigandPNGBDBM50076586((S)-2-Benzyloxycarbonylamino-3-{[3-(3-guanidino-pr...)
Affinity DataIC50:  110nM. Assay description: Antagonistic activity against vitronectin receptor
In DepthDetails ArticlePubMed