BDBM50076669 CHEMBL368148::N-Hydroxy-N-{3-[1-(4-methoxy-phenyl)-5-p-tolyl-1H-pyrazol-3-yl]-prop-2-ynyl}-benzamide
SMILES COc1ccc(cc1)-n1nc(cc1-c1ccc(C)cc1)C#CCN(O)C(=O)c1ccccc1
InChI Key InChIKey=QUQGRRKQWCNRLX-UHFFFAOYSA-N
Data  2 IC50
  Tab Delimited (TSV)   2D SDfile   Computed 3D by Vconf -m prep SDfile
Find this compound or compounds like it in BindingDB:
Activity Spreadsheet -- Enzyme Inhibition Constant Data from BindingDB
Found 2 hits for monomerid = 50076669
TargetProstaglandin G/H synthase 1/2(RAT)
The R. W. Johnson Pharmaceutical Research Institute
Curated by ChEMBL
LigandPNGBDBM50076669(CHEMBL368148 | N-Hydroxy-N-{3-[1-(4-methoxy-phenyl...)
Affinity DataIC50:  930nM. Assay description: Inhibitory activity against cyclooxygenase (COX) in intact rat barophilic leukemia cells (RBL-1)
In DepthDetails ArticlePubMed
TargetPolyunsaturated fatty acid 5-lipoxygenase(Rattus norvegicus)
The R. W. Johnson Pharmaceutical Research Institute
Curated by ChEMBL
LigandPNGBDBM50076669(CHEMBL368148 | N-Hydroxy-N-{3-[1-(4-methoxy-phenyl...)
Affinity DataIC50:  8.00E+3nM. Assay description: Inhibitory activity against 5-lipoxygenase (5-LO) in intact rat barophilic leukemia cells (RBL-1)
In DepthDetails ArticlePubMed