BDBM50077421 CHEMBL292659::[(R)-2-(4-Benzoyl-benzenesulfonyl)-1,2,3,4-tetrahydro-isoquinolin-3-yl]-oxo-acetic acid
SMILES OC(=O)C(=O)[C@H]1Cc2ccccc2CN1S(=O)(=O)c1ccc(cc1)C(=O)c1ccccc1
InChI Key InChIKey=QZGLUUHBLOQISE-OAQYLSRUSA-N
Data  1 IC50
  Tab Delimited (TSV)   2D SDfile   Computed 3D by Vconf -m prep SDfile
Find this compound or compounds like it in BindingDB:
Activity Spreadsheet -- Enzyme Inhibition Constant Data from BindingDB
Found 1 hit for monomerid = 50077421
TargetNeutrophil collagenase(Homo sapiens (Human))
Hoechst Marion Roussel
Curated by ChEMBL
LigandPNGBDBM50077421(CHEMBL292659 | [(R)-2-(4-Benzoyl-benzenesulfonyl)-...)
Affinity DataIC50:  300nM. Assay description: Inhibition of human neutrophil collagenase [Matrix Metalloprotease-8, MMP-8]
In DepthDetails ArticlePubMed