BDBM50079424 (S)-3-[2-(3,4-Dimethoxy-phenyl)-ethoxy]-2-(4,6-dimethyl-pyrimidin-2-yloxy)-3,3-diphenyl-propionic acid::CHEMBL316735
SMILES COc1ccc(CCOC([C@H](Oc2nc(C)cc(C)n2)C(O)=O)(c2ccccc2)c2ccccc2)cc1OC
InChI Key InChIKey=CLSJNXXMIVKULC-MUUNZHRXSA-N
Data  4 KI
  Tab Delimited (TSV)   2D SDfile   Computed 3D by Vconf -m prep SDfile
Find this compound or compounds like it in BindingDB:
Activity Spreadsheet -- Enzyme Inhibition Constant Data from BindingDB
Found 4 hits for monomerid = 50079424
TargetEndothelin-1 receptor(Homo sapiens (Human))
Basf
Curated by ChEMBL
LigandPNGBDBM50079424((S)-3-[2-(3,4-Dimethoxy-phenyl)-ethoxy]-2-(4,6-dim...)
Affinity DataKi:  2.15nM. Assay description: Inhibition of [125I]-ET-1 (ETA assay) binding to human cloned Endothelin A receptor in CHO cells
In DepthDetails ArticlePubMed
TargetEndothelin-1 receptor(Homo sapiens (Human))
Basf
Curated by ChEMBL
LigandPNGBDBM50079424((S)-3-[2-(3,4-Dimethoxy-phenyl)-ethoxy]-2-(4,6-dim...)
Affinity DataKi:  2.20nM. Assay description: Displacement of [125I]ET-1 from human ET-A receptor expressed in CHO cell membrane incubated for 30 mins by liquid scintillation counting method
In DepthDetails ArticlePubMed
TargetEndothelin receptor type B(Homo sapiens (Human))
Basf
Curated by ChEMBL
LigandPNGBDBM50079424((S)-3-[2-(3,4-Dimethoxy-phenyl)-ethoxy]-2-(4,6-dim...)
Affinity DataKi:  4.75nM. Assay description: Inhibition of [125I]-ET-3 (ETB assay) binding to human cloned Endothelin B receptor in CHO cells
In DepthDetails ArticlePubMed
TargetEndothelin receptor type B(Homo sapiens (Human))
Basf
Curated by ChEMBL
LigandPNGBDBM50079424((S)-3-[2-(3,4-Dimethoxy-phenyl)-ethoxy]-2-(4,6-dim...)
Affinity DataKi:  4.80nM. Assay description: Displacement of [125I]ET-3 from human ET-B receptor expressed in CHO cell membrane incubated for 30 mins by liquid scintillation counting method
In DepthDetails ArticlePubMed