BDBM50079491 Arginyl Ketomethylene analogue::CHEMBL412457
SMILES CC[C@@H](C)[C@H](NC(=O)[C@H](CCC(O)=O)NC(=O)[C@H](CCC(O)=O)NC(=O)[C@H](Cc1ccccc1)NC(=O)[C@H](CC(O)=O)NC(=O)CNC(=O)CNC(=O)CNC(=O)CNC(=O)CSCC(=O)[C@H](CCCNC(N)=N)NC(=O)[C@@H]1CCCN1C(=O)[C@H](N)Cc1ccccc1)C(=O)N1CCC[C@H]1C(=O)N[C@@H](CCC(O)=O)C(=O)N[C@@H](CCC(O)=O)C(=O)N[C@@H](Cc1ccc(O)cc1)C(=O)N[C@@H](CC(C)C)C(=O)N[C@@H](CCC(N)=O)C(O)=O
InChI Key InChIKey=ZWKLFGVUANHRBO-XARPGLJESA-N
Data  1 KI
  Tab Delimited (TSV)   2D SDfile   Computed 3D by Vconf -m prep SDfile
Find this compound or compounds like it in BindingDB:
Activity Spreadsheet -- Enzyme Inhibition Constant Data from BindingDB
Found 1 hit for monomerid = 50079491
TargetProthrombin(Homo sapiens (Human))
National Research Council Canada
Curated by ChEMBL
LigandPNGBDBM50079491(Arginyl Ketomethylene analogue | CHEMBL412457)
Affinity DataKi:  0.00940nM. Assay description: Inhibitory constant against thrombin
In DepthDetails ArticlePubMed