BDBM50079631 CHEMBL291933::[(S)-1-[(R)-2-Acetylamino-3-(1H-indol-3-yl)-propionylamino]-2-(4-carbamimidoyl-phenyl)-ethyl]-phenyl-phosphinium
SMILES CC(=O)N[C@H](Cc1c[nH]c2ccccc12)C(=O)NC(Cc1ccc(cc1)C(N)=[NH2+])=P(O)([O-])c1ccccc1
InChI Key InChIKey=GBTDCVGJBFSPDX-RUZDIDTESA-O
Data  1 IC50
  Tab Delimited (TSV)   2D SDfile   Computed 3D by Vconf -m prep SDfile
Find this compound or compounds like it in BindingDB:
Activity Spreadsheet -- Enzyme Inhibition Constant Data from BindingDB
Found 1 hit for monomerid = 50079631
TargetProthrombin(Homo sapiens (Human))
University Of Illinois At Chicago
Curated by ChEMBL
LigandPNGBDBM50079631(CHEMBL291933 | [(S)-1-[(R)-2-Acetylamino-3-(1H-ind...)
Affinity DataIC50:  7.50E+3nM. Assay description: In vitro inhibitory activity against thrombin
In DepthDetails ArticlePubMed