BDBM50080169 CHEMBL76625::Phosphoric acid mono-(4-{(S)-2-acetylamino-2-[(4-cyclohexylmethyl-thiazol-2-ylmethyl)-carbamoyl]-ethyl}-phenyl) ester
SMILES CC(=O)N[C@@H](Cc1ccc(OP(O)(O)=O)cc1)C(=O)NCc1nc(CC2CCCCC2)cs1
InChI Key InChIKey=FQTHMIWOOAGILS-FQEVSTJZSA-N
Data  2 IC50
  Tab Delimited (TSV)   2D SDfile   Computed 3D by Vconf -m prep SDfile
Find this compound or compounds like it in BindingDB:
Activity Spreadsheet -- Enzyme Inhibition Constant Data from BindingDB
Found 2 hits for monomerid = 50080169
TargetProto-oncogene tyrosine-protein kinase Src(Homo sapiens (Human))
Ariad Pharmaceuticals
Curated by ChEMBL
LigandPNGBDBM50080169(CHEMBL76625 | Phosphoric acid mono-(4-{(S)-2-acety...)
Affinity DataIC50:  4.83E+5nM. Assay description: Inhibition of binding to Src SH2 domain
In DepthDetails ArticlePubMed
TargetProto-oncogene tyrosine-protein kinase Src(Homo sapiens (Human))
Ariad Pharmaceuticals
Curated by ChEMBL
LigandPNGBDBM50080169(CHEMBL76625 | Phosphoric acid mono-(4-{(S)-2-acety...)
Affinity DataIC50:  4.83E+5nM. Assay description: Binding affinity against Src-homology 2 (SRC SH2).
In DepthDetails ArticlePubMed