BDBM50080186 CHEMBL77702::Phosphoric acid mono-(4-{(S)-2-acetylamino-2-[(S)-1-(5-hexyl-thiazol-2-yl)-2-(1H-indol-3-yl)-ethylcarbamoyl]-ethyl}-phenyl) ester
SMILES CCCCCCc1cnc(s1)[C@H](Cc1c[nH]c2ccccc12)NC(=O)[C@H](Cc1ccc(OP(O)(O)=O)cc1)NC(C)=O
InChI Key InChIKey=JOMYGHSZNBWZSV-NSOVKSMOSA-N
Data  1 IC50
  Tab Delimited (TSV)   2D SDfile   Computed 3D by Vconf -m prep SDfile
Find this compound or compounds like it in BindingDB:
Activity Spreadsheet -- Enzyme Inhibition Constant Data from BindingDB
Found 1 hit for monomerid = 50080186
TargetProto-oncogene tyrosine-protein kinase Src(Homo sapiens (Human))
Ariad Pharmaceuticals
Curated by ChEMBL
LigandPNGBDBM50080186(CHEMBL77702 | Phosphoric acid mono-(4-{(S)-2-acety...)
Affinity DataIC50:  1.40E+4nM. Assay description: Binding affinity against Src-homology 2 (SRC SH2).
In DepthDetails ArticlePubMed