BDBM50080215 CHEMBL76302::N-{(S)-1-Benzyl-2-oxo-2-[2-(5-pyridin-2-yl-thiophene-2-sulfonylamino)-ethylcarbamoyl]-ethyl}-benzamide
SMILES O=C(NCCNS(=O)(=O)c1ccc(s1)-c1ccccn1)C(=O)[C@H](Cc1ccccc1)NC(=O)c1ccccc1
InChI Key InChIKey=KUHKUEPPTKJUMQ-QHCPKHFHSA-N
Data  1 KI
  Tab Delimited (TSV)   2D SDfile   Computed 3D by Vconf -m prep SDfile
Find this compound or compounds like it in BindingDB:
Activity Spreadsheet -- Enzyme Inhibition Constant Data from BindingDB
Found 1 hit for monomerid = 50080215
TargetCalpain-1 catalytic subunit(Homo sapiens (Human))
Cephalon
Curated by ChEMBL
LigandPNGBDBM50080215(CHEMBL76302 | N-{(S)-1-Benzyl-2-oxo-2-[2-(5-pyridi...)
Affinity DataKi:  570nM. Assay description: Inhibitory activity against recombinant human calpain I
In DepthDetails ArticlePubMed