BDBM50080218 (S)-3-Isobutyrylamino-2-oxo-4-phenyl-N-[2-(5-pyridin-2-yl-thiophene-2-sulfonylamino)-ethyl]-butyramide::CHEMBL80425
SMILES CC(C)C(=O)N[C@@H](Cc1ccccc1)C(=O)C(=O)NCCNS(=O)(=O)c1ccc(s1)-c1ccccn1
InChI Key InChIKey=GMBVVLAWTUBETD-FQEVSTJZSA-N
Data  1 KI
  Tab Delimited (TSV)   2D SDfile   Computed 3D by Vconf -m prep SDfile
Find this compound or compounds like it in BindingDB:
Activity Spreadsheet -- Enzyme Inhibition Constant Data from BindingDB
Found 1 hit for monomerid = 50080218
TargetCalpain-1 catalytic subunit(Homo sapiens (Human))
Cephalon
Curated by ChEMBL
LigandPNGBDBM50080218((S)-3-Isobutyrylamino-2-oxo-4-phenyl-N-[2-(5-pyrid...)
Affinity DataKi:  1.10E+3nM. Assay description: Inhibitory activity against recombinant human Calpain 1
In DepthDetails ArticlePubMed